Error : in create_uic_task unsupported operand type(s) for %: 'list' and 'str'

1>------ Build started: Project: _WAF_, Configuration: [testenv] profile x64 ------
1>[WAF] Engine Root: c:\Amazon\Lumberyard\1.22.0.0\dev\
1>[WAF] Executing 'build_win_x64_vs2017_profile' in 'c:\Amazon\Lumberyard\1.22.0.0\dev\BinTemp\win_x64_vs2017_profile'
1>[WARN] Missing JDK path from Setup Assistant detected. Target platforms that require java will be disabled. Please re-run Setup Assistant with "Compile For Android" enabled and run the configure command again.
1>[SETTINGS] Target Output folder (win_x64_vs2017/profile): Bin64vc141
1>[WARNING] Incredibuild disabled by build option
1>[WARN] 3rd Party alias 'qt' specified in c:\Amazon\Lumberyard\1.22.0.0\dev\Code\Sandbox\Editor\wscript:30 (build) is not enabled. This may cause build errors.  Make sure that at least one of the following options are checked in setup assistant: ['Compile the engine and asset pipeline', 'Compile Lumberyard Editor and tools', Option 'setuplinux']
1>[WARN] 3rd Party alias 'qt' specified in c:\Amazon\Lumberyard\1.22.0.0\dev\Code\Sandbox\Editor\wscript:31 (build) is not enabled. This may cause build errors.  Make sure that at least one of the following options are checked in setup assistant: ['Compile the engine and asset pipeline', 'Compile Lumberyard Editor and tools', Option 'setuplinux']
1>[WARN] 3rd Party alias 'qt' specified in c:\Amazon\Lumberyard\1.22.0.0\dev\Code\Sandbox\Editor\wscript:32 (build) is not enabled. This may cause build errors.  Make sure that at least one of the following options are checked in setup assistant: ['Compile the engine and asset pipeline', 'Compile Lumberyard Editor and tools', Option 'setuplinux']
1>[WARN] 3rd Party alias 'qt' specified in c:\Amazon\Lumberyard\1.22.0.0\dev\Code\Tools\Woodpecker\wscript:56 (build) is not enabled. This may cause build errors.  Make sure that at least one of the following options are checked in setup assistant: ['Compile the engine and asset pipeline', 'Compile Lumberyard Editor and tools', Option 'setuplinux']
1>[WARN] 3rd Party alias 'qt' specified in c:\Amazon\Lumberyard\1.22.0.0\dev\Code\Tools\Woodpecker\wscript:104 (build) is not enabled. This may cause build errors.  Make sure that at least one of the following options are checked in setup assistant: ['Compile the engine and asset pipeline', 'Compile Lumberyard Editor and tools', Option 'setuplinux']
1>unable to find QT
1>unable to find QT
1>Traceback (most recent call last):
1>c:\Amazon\Lumberyard\1.22.0.0\dev\Tools\build\waf-1.7.13\waflib\Scripting.py(226):  in waf_entry_point
1>c:\Amazon\Lumberyard\1.22.0.0\dev\Tools\build\waf-1.7.13\waflib\Scripting.py(342):  in run_commands
1>c:\Amazon\Lumberyard\1.22.0.0\dev\Tools\build\waf-1.7.13\waflib\Scripting.py(319):  in run_command
1>.\Tools\build\waf-1.7.13\lmbrwaflib\msvs.py(2074):                                  in override_build_state
1>.\Tools\build\waf-1.7.13\lmbrwaflib\build_configurations.py(1496):                  in execute
1>c:\Amazon\Lumberyard\1.22.0.0\dev\Tools\build\waf-1.7.13\waflib\Scripting.py(696):  in execute
1>c:\Amazon\Lumberyard\1.22.0.0\dev\Tools\build\waf-1.7.13\waflib\Build.py(254):      in execute
1>c:\Amazon\Lumberyard\1.22.0.0\dev\Tools\build\waf-1.7.13\waflib\Build.py(277):      in execute_build
1>c:\Amazon\Lumberyard\1.22.0.0\dev\Tools\build\waf-1.7.13\waflib\Build.py(370):      in compile
1>c:\Amazon\Lumberyard\1.22.0.0\dev\Tools\build\waf-1.7.13\waflib\Runner.py(307):     in start
1>c:\Amazon\Lumberyard\1.22.0.0\dev\Tools\build\waf-1.7.13\waflib\Runner.py(209):     in refill_task_list
1>c:\Amazon\Lumberyard\1.22.0.0\dev\Tools\build\waf-1.7.13\waflib\Build.py(818):      in get_build_iterator
1>c:\Amazon\Lumberyard\1.22.0.0\dev\Tools\build\waf-1.7.13\waflib\Build.py(789):      in post_group
1>c:\Amazon\Lumberyard\1.22.0.0\dev\Tools\build\waf-1.7.13\waflib\TaskGen.py(218):    in post
1>c:\Amazon\Lumberyard\1.22.0.0\dev\Tools\build\waf-1.7.13\waflib\TaskGen.py(528):    in process_source
1>.\Tools\build\waf-1.7.13\lmbrwaflib\qt5.py(500): error : in create_uic_task unsupported operand type(s) for %: 'list' and 'str'
1>c:\Amazon\Lumberyard\1.22.0.0\dev\_WAF_\msbuild\waf_build.targets(74,9): error MSB3073: The command "cd /d "c:\Amazon\Lumberyard\1.22.0.0\dev" & "lmbr_waf.bat"  build_win_x64_vs2017_profile --execsolution="c:\Amazon\Lumberyard\1.22.0.0\dev\Solutions\testenv_vs15.sln" --msvs-version=15 --enabled-game-projects=testenv --project-spec=testenv" exited with code 1.
1>Done building project "_WAF_.vcxproj" -- FAILED.
2>------ Skipped Build: Project: testenv (testenv\testenv), Configuration: [testenv] profile x64 ------
2>Project not selected to build for this solution configuration 
========== Build: 0 succeeded, 1 failed, 0 up-to-date, 1 skipped ==========

Maybe same error like this.