Error on Build New Project -Lumberyard Editor 1.15.0.0

Although follow this guide

https://docs.aws.amazon.com/zh_cn/lumberyard/latest/userguide/configurator-projects.html

but got error(Why and How to solve?):

7265-002.jpg


"E:\Amazon\Lumberyard\1.15.0.0\dev\lmbr_waf.bat" build_win_x64_vs2015_profile --enabled-game-projects=MyNewProject -p MyNewProject
[WAF] Engine Root: E:\Amazon\Lumberyard\1.15.0.0\dev\
A custom BuildEnv.json file was not found. This build will be untagged.
A custom BuildEnv.json file was not found. This build will be untagged.
[WAF] Executing 'build_win_x64_vs2015_profile' in 'e:\Amazon\Lumberyard\1.15.0.0\dev\BinTemp\win_x64_vs2015_profile'
[WARN] Game folder 'StarterGame' configured in bootstrap.cfg is the enabled game for this build. In order to run or debug for the game 'MyNewProject', they need to be set in bootstrap.cfg under the 'sys_game_folder' entry accordingly
[WARNING] Incredibuild disabled by build option
[WARN] 3rd Party alias 'qt' specified in e:\Amazon\Lumberyard\1.15.0.0\dev\Code\Tools\Woodpecker\wscript:54 (build) is not enabled. Make sure that at least one of the following roles is enabled: []
[WARN] 3rd Party alias 'qt' specified in e:\Amazon\Lumberyard\1.15.0.0\dev\Code\Tools\Woodpecker\wscript:101 (build) is not enabled. Make sure that at least one of the following roles is enabled: []
unable to find QT
unable to find QT
[ 284/1307] winrc (win_x64_vs2015|profile): BinTemp\win_x64_vs2015_profile\Code\Launcher\WindowsLauncher\MyNewProjectWindowsLauncher_rc\MyNewProjectWindowsLauncher.auto_gen.rc -> BinTemp\win_x64_vs2015_profile\Code\Launcher\WindowsLauncher\MyNewProjectWindowsLauncher_rc\MyNewProjectWindowsLauncher.auto_gen.1623523.res
[1076/1307] cxx (win_x64_vs2015|profile): Gems\LmbrCentral\Code\Source\LmbrCentral.cpp -> BinTemp\win_x64_vs2015_profile\Gems\LmbrCentral\Code\Source\LmbrCentral.cpp.3226490.obj
[1095/1307] cxx (win_x64_vs2015|profile): Gems\LmbrCentral\Code\Source\Rendering\FogVolumeCommon.cpp -> BinTemp\win_x64_vs2015_profile\Gems\LmbrCentral\Code\Source\Rendering\FogVolumeCommon.cpp.3226490.obj
[1096/1307] cxx (win_x64_vs2015|profile): Gems\LmbrCentral\Code\Source\Rendering\FogVolumeComponent.cpp -> BinTemp\win_x64_vs2015_profile\Gems\LmbrCentral\Code\Source\Rendering\FogVolumeComponent.cpp.3226490.obj
[1097/1307] cxx (win_x64_vs2015|profile): Gems\LmbrCentral\Code\Source\Rendering\FogVolumeRequestsHandler.cpp -> BinTemp\win_x64_vs2015_profile\Gems\LmbrCentral\Code\Source\Rendering\FogVolumeRequestsHandler.cpp.3226490.obj
FogVolumeRequestsHandler.cpp
e:\Amazon\Lumberyard\1.15.0.0\dev\Gems\LmbrCentral\Code\include\LmbrCentral/Rendering/FogVolumeComponentBus.h: error C2220: warning treated as error - no 'object' file generated
e:\Amazon\Lumberyard\1.15.0.0\dev\Gems\LmbrCentral\Code\include\LmbrCentral/Rendering/FogVolumeComponentBus.h: warning C4819: The file contains a character that cannot be represented in the current code page (936). Save the file in Unicode format to prevent data loss
FogVolumeCommon.cpp
e:\Amazon\Lumberyard\1.15.0.0\dev\Gems\LmbrCentral\Code\include\LmbrCentral/Rendering/FogVolumeComponentBus.h: error C2220: warning treated as error - no 'object' file generated
e:\Amazon\Lumberyard\1.15.0.0\dev\Gems\LmbrCentral\Code\include\LmbrCentral/Rendering/FogVolumeComponentBus.h: warning C4819: The file contains a character that cannot be represented in the current code page (936). Save the file in Unicode format to prevent data loss
FogVolumeComponent.cpp
e:\Amazon\Lumberyard\1.15.0.0\dev\Gems\LmbrCentral\Code\include\LmbrCentral/Rendering/FogVolumeComponentBus.h: error C2220: warning treated as error - no 'object' file generated
e:\Amazon\Lumberyard\1.15.0.0\dev\Gems\LmbrCentral\Code\include\LmbrCentral/Rendering/FogVolumeComponentBus.h: warning C4819: The file contains a character that cannot be represented in the current code page (936). Save the file in Unicode format to prevent data loss
LmbrCentral.cpp
e:\Amazon\Lumberyard\1.15.0.0\dev\Gems\LmbrCentral\Code\include\LmbrCentral/Rendering/FogVolumeComponentBus.h: error C2220: warning treated as error - no 'object' file generated
e:\Amazon\Lumberyard\1.15.0.0\dev\Gems\LmbrCentral\Code\include\LmbrCentral/Rendering/FogVolumeComponentBus.h: warning C4819: The file contains a character that cannot be represented in the current code page (936). Save the file in Unicode format to prevent data loss
Build failed
<++++++++++++++++++++++++++++++++++++++++++++++++++++++++++++++++++++++++++++++++++++++++++++++++++++++++++++++++++++++++++++++++++++++++++++++++++++++++++++++++++>
Compilation failed - File: 'FogVolumeRequestsHandler.cpp.3226490.obj', Module: 'LmbrCentral', Configuration: 'win_x64_vs2015|profile', error code 2
Input Files: 'e:\Amazon\Lumberyard\1.15.0.0\dev\Gems\LmbrCentral\Code\Source\Rendering\FogVolumeRequestsHandler.cpp'
Output Files: 'e:\Amazon\Lumberyard\1.15.0.0\dev\BinTemp\win_x64_vs2015_profile\Gems\LmbrCentral\Code\Source\Rendering\FogVolumeRequestsHandler.cpp.3226490.obj'
Command: 'E:\Program Files (x86)\Microsoft Visual Studio 14.0\VC\BIN\amd64\CL.exe /nologo /W3 /WX /MP /Gy /GF /Gm- /fp:fast /Zc:wchar_t /Zc:forScope /Zc:inline /Gd /wd4530 /wd4577 /Ox /Ob2 /Ot /Oi /Oy- /FS /bigobj /GR- /showIncludes /MD /Z7 /YuLmbrCentral_precompiled.h /Fpe:\Amazon\Lumberyard\1.15.0.0\dev\BinTemp\win_x64_vs2015_profile\Gems\LmbrCentral\Code\Source\LmbrCentral_precompiled.3226490.pch /Ie:\Amazon\Lumberyard\1.15.0.0\dev\BinTemp\win_x64_vs2015_profile\Gems\LmbrCentral\Code /Ie:\Amazon\Lumberyard\1.15.0.0\dev\Gems\LmbrCentral\Code /IE:\Amazon\Lumberyard\1.15.0.0\3rdParty\boost\1.61.0-az.2 /Ie:\Amazon\Lumberyard\1.15.0.0\dev\Code\CryEngine\CryCommon /Ie:\Amazon\Lumberyard\1.15.0.0\dev\Gems\LmbrCentral\Code\include /Ie:\Amazon\Lumberyard\1.15.0.0\dev\Gems\LmbrCentral\Code\Source /Ie:\Amazon\Lumberyard\1.15.0.0\dev\Code\CryEngine\CryAction /Ie:\Amazon\Lumberyard\1.15.0.0\dev\BinTemp\win_x64_vs2015_profile\Gems\CryLegacy\Code\Source\CryAction /Ie:\Amazon\Lumberyard\1.15.0.0\dev\Gems\CryLegacy\Code\Source\CryAction /Ie:\Amazon\Lumberyard\1.15.0.0\dev\BinTemp\win_x64_vs2015_profile\Code\Framework\AzFramework /Ie:\Amazon\Lumberyard\1.15.0.0\dev\Code\Framework\AzFramework /Ie:\Amazon\Lumberyard\1.15.0.0\dev\BinTemp\win_x64_vs2015_profile\Code\Framework\GridMate /Ie:\Amazon\Lumberyard\1.15.0.0\dev\Code\Framework\GridMate /Ie:\Amazon\Lumberyard\1.15.0.0\dev\BinTemp\win_x64_vs2015_profile\Code\Framework\AzCore /Ie:\Amazon\Lumberyard\1.15.0.0\dev\Code\Framework\AzCore /IE:\Program Files (x86)\Microsoft Visual Studio 14.0\VC\INCLUDE /IE:\Program Files (x86)\Microsoft Visual Studio 14.0\VC\ATLMFC\INCLUDE /IC:\Program Files (x86)\Windows Kits\10\include\10.0.17134.0\ucrt /IC:\Program Files (x86)\Windows Kits\NETFXSDK\4.6.1\include\um /IC:\Program Files (x86)\Windows Kits\10\include\10.0.17134.0\shared /IC:\Program Files (x86)\Windows Kits\10\include\10.0.17134.0\um /IC:\Program Files (x86)\Windows Kits\10\include\10.0.17134.0\winrt /IE:\Amazon\Lumberyard\1.15.0.0\3rdParty\rapidjson\rapidjson-1.0.2.1\include /IE:\Amazon\Lumberyard\1.15.0.0\3rdParty\rapidxml\1.13-modified.1\include /IE:\Amazon\Lumberyard\1.15.0.0\3rdParty\Lua\5.1.1.8-az /IE:\Amazon\Lumberyard\1.15.0.0\3rdParty\zlib\1.2.8-pkg.2\include /D_WIN32 /D_WIN64 /DCODE_BASE_FOLDER="e:/Amazon/Lumberyard/1.15.0.0/dev/Code/" /D_PROFILE /DPROFILE /DNDEBUG /DEXE_VERSION_INFO_0=1 /DEXE_VERSION_INFO_1=15 /DEXE_VERSION_INFO_2=0 /DEXE_VERSION_INFO_3=0 /DBINFOLDER_NAME="Bin64vc140" /DPLATFORM_SUPPORTS_AWS_NATIVE_SDK /DUSE_WINDOWS_DLL_SEMANTICS /DLY_BUILD=664281 /D_MT /D_DLL /DAZ_ENABLE_TRACING /DAZ_ENABLE_DEBUG_TOOLS e:\Amazon\Lumberyard\1.15.0.0\dev\Gems\LmbrCentral\Code\Source\Rendering\FogVolumeRequestsHandler.cpp /c /Fo e:\Amazon\Lumberyard\1.15.0.0\dev\BinTemp\win_x64_vs2015_profile\Gems\LmbrCentral\Code\Source\Rendering\FogVolumeRequestsHandler.cpp.3226490.obj'
Output:
FogVolumeRequestsHandler.cpp
e:\Amazon\Lumberyard\1.15.0.0\dev\Gems\LmbrCentral\Code\include\LmbrCentral/Rendering/FogVolumeComponentBus.h: error C2220: warning treated as error - no 'object' file generated
e:\Amazon\Lumberyard\1.15.0.0\dev\Gems\LmbrCentral\Code\include\LmbrCentral/Rendering/FogVolumeComponentBus.h: warning C4819: The file contains a character that cannot be represented in the current code page (936). Save the file in Unicode format to prevent data loss
<++++++++++++++++++++++++++++++++++++++++++++++++++++++++++++++++++++++++++++++++++++++++++++++++++++++++++++++++++++++++++++++++++++++++++++++++++++++++++++++++++>
<++++++++++++++++++++++++++++++++++++++++++++++++++++++++++++++++++++++++++++++++++++++++++++++++++++++++++++++++++++++++++++++++++++++++++++++++++++++++++++++++++>
Compilation failed - File: 'FogVolumeCommon.cpp.3226490.obj', Module: 'LmbrCentral', Configuration: 'win_x64_vs2015|profile', error code 2
Input Files: 'e:\Amazon\Lumberyard\1.15.0.0\dev\Gems\LmbrCentral\Code\Source\Rendering\FogVolumeCommon.cpp'
Output Files: 'e:\Amazon\Lumberyard\1.15.0.0\dev\BinTemp\win_x64_vs2015_profile\Gems\LmbrCentral\Code\Source\Rendering\FogVolumeCommon.cpp.3226490.obj'
Command: 'E:\Program Files (x86)\Microsoft Visual Studio 14.0\VC\BIN\amd64\CL.exe /nologo /W3 /WX /MP /Gy /GF /Gm- /fp:fast /Zc:wchar_t /Zc:forScope /Zc:inline /Gd /wd4530 /wd4577 /Ox /Ob2 /Ot /Oi /Oy- /FS /bigobj /GR- /showIncludes /MD /Z7 /YuLmbrCentral_precompiled.h /Fpe:\Amazon\Lumberyard\1.15.0.0\dev\BinTemp\win_x64_vs2015_profile\Gems\LmbrCentral\Code\Source\LmbrCentral_precompiled.3226490.pch /Ie:\Amazon\Lumberyard\1.15.0.0\dev\BinTemp\win_x64_vs2015_profile\Gems\LmbrCentral\Code /Ie:\Amazon\Lumberyard\1.15.0.0\dev\Gems\LmbrCentral\Code /IE:\Amazon\Lumberyard\1.15.0.0\3rdParty\boost\1.61.0-az.2 /Ie:\Amazon\Lumberyard\1.15.0.0\dev\Code\CryEngine\CryCommon /Ie:\Amazon\Lumberyard\1.15.0.0\dev\Gems\LmbrCentral\Code\include /Ie:\Amazon\Lumberyard\1.15.0.0\dev\Gems\LmbrCentral\Code\Source /Ie:\Amazon\Lumberyard\1.15.0.0\dev\Code\CryEngine\CryAction /Ie:\Amazon\Lumberyard\1.15.0.0\dev\BinTemp\win_x64_vs2015_profile\Gems\CryLegacy\Code\Source\CryAction /Ie:\Amazon\Lumberyard\1.15.0.0\dev\Gems\CryLegacy\Code\Source\CryAction /Ie:\Amazon\Lumberyard\1.15.0.0\dev\BinTemp\win_x64_vs2015_profile\Code\Framework\AzFramework /Ie:\Amazon\Lumberyard\1.15.0.0\dev\Code\Framework\AzFramework /Ie:\Amazon\Lumberyard\1.15.0.0\dev\BinTemp\win_x64_vs2015_profile\Code\Framework\GridMate /Ie:\Amazon\Lumberyard\1.15.0.0\dev\Code\Framework\GridMate /Ie:\Amazon\Lumberyard\1.15.0.0\dev\BinTemp\win_x64_vs2015_profile\Code\Framework\AzCore /Ie:\Amazon\Lumberyard\1.15.0.0\dev\Code\Framework\AzCore /IE:\Program Files (x86)\Microsoft Visual Studio 14.0\VC\INCLUDE /IE:\Program Files (x86)\Microsoft Visual Studio 14.0\VC\ATLMFC\INCLUDE /IC:\Program Files (x86)\Windows Kits\10\include\10.0.17134.0\ucrt /IC:\Program Files (x86)\Windows Kits\NETFXSDK\4.6.1\include\um /IC:\Program Files (x86)\Windows Kits\10\include\10.0.17134.0\shared /IC:\Program Files (x86)\Windows Kits\10\include\10.0.17134.0\um /IC:\Program Files (x86)\Windows Kits\10\include\10.0.17134.0\winrt /IE:\Amazon\Lumberyard\1.15.0.0\3rdParty\rapidjson\rapidjson-1.0.2.1\include /IE:\Amazon\Lumberyard\1.15.0.0\3rdParty\rapidxml\1.13-modified.1\include /IE:\Amazon\Lumberyard\1.15.0.0\3rdParty\Lua\5.1.1.8-az /IE:\Amazon\Lumberyard\1.15.0.0\3rdParty\zlib\1.2.8-pkg.2\include /D_WIN32 /D_WIN64 /DCODE_BASE_FOLDER="e:/Amazon/Lumberyard/1.15.0.0/dev/Code/" /D_PROFILE /DPROFILE /DNDEBUG /DEXE_VERSION_INFO_0=1 /DEXE_VERSION_INFO_1=15 /DEXE_VERSION_INFO_2=0 /DEXE_VERSION_INFO_3=0 /DBINFOLDER_NAME="Bin64vc140" /DPLATFORM_SUPPORTS_AWS_NATIVE_SDK /DUSE_WINDOWS_DLL_SEMANTICS /DLY_BUILD=664281 /D_MT /D_DLL /DAZ_ENABLE_TRACING /DAZ_ENABLE_DEBUG_TOOLS e:\Amazon\Lumberyard\1.15.0.0\dev\Gems\LmbrCentral\Code\Source\Rendering\FogVolumeCommon.cpp /c /Fo e:\Amazon\Lumberyard\1.15.0.0\dev\BinTemp\win_x64_vs2015_profile\Gems\LmbrCentral\Code\Source\Rendering\FogVolumeCommon.cpp.3226490.obj'
Output:
FogVolumeCommon.cpp
e:\Amazon\Lumberyard\1.15.0.0\dev\Gems\LmbrCentral\Code\include\LmbrCentral/Rendering/FogVolumeComponentBus.h: error C2220: warning treated as error - no 'object' file generated
e:\Amazon\Lumberyard\1.15.0.0\dev\Gems\LmbrCentral\Code\include\LmbrCentral/Rendering/FogVolumeComponentBus.h: warning C4819: The file contains a character that cannot be represented in the current code page (936). Save the file in Unicode format to prevent data loss
<++++++++++++++++++++++++++++++++++++++++++++++++++++++++++++++++++++++++++++++++++++++++++++++++++++++++++++++++++++++++++++++++++++++++++++++++++++++++++++++++++>
<++++++++++++++++++++++++++++++++++++++++++++++++++++++++++++++++++++++++++++++++++++++++++++++++++++++++++++++++++++++++++++++++++++++++++++++++++++++++++++++++++>
Compilation failed - File: 'FogVolumeComponent.cpp.3226490.obj', Module: 'LmbrCentral', Configuration: 'win_x64_vs2015|profile', error code 2
Input Files: 'e:\Amazon\Lumberyard\1.15.0.0\dev\Gems\LmbrCentral\Code\Source\Rendering\FogVolumeComponent.cpp'
Output Files: 'e:\Amazon\Lumberyard\1.15.0.0\dev\BinTemp\win_x64_vs2015_profile\Gems\LmbrCentral\Code\Source\Rendering\FogVolumeComponent.cpp.3226490.obj'
Command: 'E:\Program Files (x86)\Microsoft Visual Studio 14.0\VC\BIN\amd64\CL.exe /nologo /W3 /WX /MP /Gy /GF /Gm- /fp:fast /Zc:wchar_t /Zc:forScope /Zc:inline /Gd /wd4530 /wd4577 /Ox /Ob2 /Ot /Oi /Oy- /FS /bigobj /GR- /showIncludes /MD /Z7 /YuLmbrCentral_precompiled.h /Fpe:\Amazon\Lumberyard\1.15.0.0\dev\BinTemp\win_x64_vs2015_profile\Gems\LmbrCentral\Code\Source\LmbrCentral_precompiled.3226490.pch /Ie:\Amazon\Lumberyard\1.15.0.0\dev\BinTemp\win_x64_vs2015_profile\Gems\LmbrCentral\Code /Ie:\Amazon\Lumberyard\1.15.0.0\dev\Gems\LmbrCentral\Code /IE:\Amazon\Lumberyard\1.15.0.0\3rdParty\boost\1.61.0-az.2 /Ie:\Amazon\Lumberyard\1.15.0.0\dev\Code\CryEngine\CryCommon /Ie:\Amazon\Lumberyard\1.15.0.0\dev\Gems\LmbrCentral\Code\include /Ie:\Amazon\Lumberyard\1.15.0.0\dev\Gems\LmbrCentral\Code\Source /Ie:\Amazon\Lumberyard\1.15.0.0\dev\Code\CryEngine\CryAction /Ie:\Amazon\Lumberyard\1.15.0.0\dev\BinTemp\win_x64_vs2015_profile\Gems\CryLegacy\Code\Source\CryAction /Ie:\Amazon\Lumberyard\1.15.0.0\dev\Gems\CryLegacy\Code\Source\CryAction /Ie:\Amazon\Lumberyard\1.15.0.0\dev\BinTemp\win_x64_vs2015_profile\Code\Framework\AzFramework /Ie:\Amazon\Lumberyard\1.15.0.0\dev\Code\Framework\AzFramework /Ie:\Amazon\Lumberyard\1.15.0.0\dev\BinTemp\win_x64_vs2015_profile\Code\Framework\GridMate /Ie:\Amazon\Lumberyard\1.15.0.0\dev\Code\Framework\GridMate /Ie:\Amazon\Lumberyard\1.15.0.0\dev\BinTemp\win_x64_vs2015_profile\Code\Framework\AzCore /Ie:\Amazon\Lumberyard\1.15.0.0\dev\Code\Framework\AzCore /IE:\Program Files (x86)\Microsoft Visual Studio 14.0\VC\INCLUDE /IE:\Program Files (x86)\Microsoft Visual Studio 14.0\VC\ATLMFC\INCLUDE /IC:\Program Files (x86)\Windows Kits\10\include\10.0.17134.0\ucrt /IC:\Program Files (x86)\Windows Kits\NETFXSDK\4.6.1\include\um /IC:\Program Files (x86)\Windows Kits\10\include\10.0.17134.0\shared /IC:\Program Files (x86)\Windows Kits\10\include\10.0.17134.0\um /IC:\Program Files (x86)\Windows Kits\10\include\10.0.17134.0\winrt /IE:\Amazon\Lumberyard\1.15.0.0\3rdParty\rapidjson\rapidjson-1.0.2.1\include /IE:\Amazon\Lumberyard\1.15.0.0\3rdParty\rapidxml\1.13-modified.1\include /IE:\Amazon\Lumberyard\1.15.0.0\3rdParty\Lua\5.1.1.8-az /IE:\Amazon\Lumberyard\1.15.0.0\3rdParty\zlib\1.2.8-pkg.2\include /D_WIN32 /D_WIN64 /DCODE_BASE_FOLDER="e:/Amazon/Lumberyard/1.15.0.0/dev/Code/" /D_PROFILE /DPROFILE /DNDEBUG /DEXE_VERSION_INFO_0=1 /DEXE_VERSION_INFO_1=15 /DEXE_VERSION_INFO_2=0 /DEXE_VERSION_INFO_3=0 /DBINFOLDER_NAME="Bin64vc140" /DPLATFORM_SUPPORTS_AWS_NATIVE_SDK /DUSE_WINDOWS_DLL_SEMANTICS /DLY_BUILD=664281 /D_MT /D_DLL /DAZ_ENABLE_TRACING /DAZ_ENABLE_DEBUG_TOOLS e:\Amazon\Lumberyard\1.15.0.0\dev\Gems\LmbrCentral\Code\Source\Rendering\FogVolumeComponent.cpp /c /Fo e:\Amazon\Lumberyard\1.15.0.0\dev\BinTemp\win_x64_vs2015_profile\Gems\LmbrCentral\Code\Source\Rendering\FogVolumeComponent.cpp.3226490.obj'
Output:
FogVolumeComponent.cpp
e:\Amazon\Lumberyard\1.15.0.0\dev\Gems\LmbrCentral\Code\include\LmbrCentral/Rendering/FogVolumeComponentBus.h: error C2220: warning treated as error - no 'object' file generated
e:\Amazon\Lumberyard\1.15.0.0\dev\Gems\LmbrCentral\Code\include\LmbrCentral/Rendering/FogVolumeComponentBus.h: warning C4819: The file contains a character that cannot be represented in the current code page (936). Save the file in Unicode format to prevent data loss
<++++++++++++++++++++++++++++++++++++++++++++++++++++++++++++++++++++++++++++++++++++++++++++++++++++++++++++++++++++++++++++++++++++++++++++++++++++++++++++++++++>
<++++++++++++++++++++++++++++++++++++++++++++++++++++++++++++++++++++++++++++++++++++++++++++++++++++++++++++++++++++++++++++++++++++++++++++++++++++++++++++++++++>
Compilation failed - File: 'LmbrCentral.cpp.3226490.obj', Module: 'LmbrCentral', Configuration: 'win_x64_vs2015|profile', error code 2
Input Files: 'e:\Amazon\Lumberyard\1.15.0.0\dev\Gems\LmbrCentral\Code\Source\LmbrCentral.cpp'
Output Files: 'e:\Amazon\Lumberyard\1.15.0.0\dev\BinTemp\win_x64_vs2015_profile\Gems\LmbrCentral\Code\Source\LmbrCentral.cpp.3226490.obj'
Command: 'E:\Program Files (x86)\Microsoft Visual Studio 14.0\VC\BIN\amd64\CL.exe /nologo /W3 /WX /MP /Gy /GF /Gm- /fp:fast /Zc:wchar_t /Zc:forScope /Zc:inline /Gd /wd4530 /wd4577 /Ox /Ob2 /Ot /Oi /Oy- /FS /bigobj /GR- /showIncludes /MD /Z7 /YuLmbrCentral_precompiled.h /Fpe:\Amazon\Lumberyard\1.15.0.0\dev\BinTemp\win_x64_vs2015_profile\Gems\LmbrCentral\Code\Source\LmbrCentral_precompiled.3226490.pch /Ie:\Amazon\Lumberyard\1.15.0.0\dev\BinTemp\win_x64_vs2015_profile\Gems\LmbrCentral\Code /Ie:\Amazon\Lumberyard\1.15.0.0\dev\Gems\LmbrCentral\Code /IE:\Amazon\Lumberyard\1.15.0.0\3rdParty\boost\1.61.0-az.2 /Ie:\Amazon\Lumberyard\1.15.0.0\dev\Code\CryEngine\CryCommon /Ie:\Amazon\Lumberyard\1.15.0.0\dev\Gems\LmbrCentral\Code\include /Ie:\Amazon\Lumberyard\1.15.0.0\dev\Gems\LmbrCentral\Code\Source /Ie:\Amazon\Lumberyard\1.15.0.0\dev\Code\CryEngine\CryAction /Ie:\Amazon\Lumberyard\1.15.0.0\dev\BinTemp\win_x64_vs2015_profile\Gems\CryLegacy\Code\Source\CryAction /Ie:\Amazon\Lumberyard\1.15.0.0\dev\Gems\CryLegacy\Code\Source\CryAction /Ie:\Amazon\Lumberyard\1.15.0.0\dev\BinTemp\win_x64_vs2015_profile\Code\Framework\AzFramework /Ie:\Amazon\Lumberyard\1.15.0.0\dev\Code\Framework\AzFramework /Ie:\Amazon\Lumberyard\1.15.0.0\dev\BinTemp\win_x64_vs2015_profile\Code\Framework\GridMate /Ie:\Amazon\Lumberyard\1.15.0.0\dev\Code\Framework\GridMate /Ie:\Amazon\Lumberyard\1.15.0.0\dev\BinTemp\win_x64_vs2015_profile\Code\Framework\AzCore /Ie:\Amazon\Lumberyard\1.15.0.0\dev\Code\Framework\AzCore /IE:\Program Files (x86)\Microsoft Visual Studio 14.0\VC\INCLUDE /IE:\Program Files (x86)\Microsoft Visual Studio 14.0\VC\ATLMFC\INCLUDE /IC:\Program Files (x86)\Windows Kits\10\include\10.0.17134.0\ucrt /IC:\Program Files (x86)\Windows Kits\NETFXSDK\4.6.1\include\um /IC:\Program Files (x86)\Windows Kits\10\include\10.0.17134.0\shared /IC:\Program Files (x86)\Windows Kits\10\include\10.0.17134.0\um /IC:\Program Files (x86)\Windows Kits\10\include\10.0.17134.0\winrt /IE:\Amazon\Lumberyard\1.15.0.0\3rdParty\rapidjson\rapidjson-1.0.2.1\include /IE:\Amazon\Lumberyard\1.15.0.0\3rdParty\rapidxml\1.13-modified.1\include /IE:\Amazon\Lumberyard\1.15.0.0\3rdParty\Lua\5.1.1.8-az /IE:\Amazon\Lumberyard\1.15.0.0\3rdParty\zlib\1.2.8-pkg.2\include /D_WIN32 /D_WIN64 /DCODE_BASE_FOLDER="e:/Amazon/Lumberyard/1.15.0.0/dev/Code/" /D_PROFILE /DPROFILE /DNDEBUG /DEXE_VERSION_INFO_0=1 /DEXE_VERSION_INFO_1=15 /DEXE_VERSION_INFO_2=0 /DEXE_VERSION_INFO_3=0 /DBINFOLDER_NAME="Bin64vc140" /DPLATFORM_SUPPORTS_AWS_NATIVE_SDK /DUSE_WINDOWS_DLL_SEMANTICS /DLY_BUILD=664281 /D_MT /D_DLL /DAZ_ENABLE_TRACING /DAZ_ENABLE_DEBUG_TOOLS e:\Amazon\Lumberyard\1.15.0.0\dev\Gems\LmbrCentral\Code\Source\LmbrCentral.cpp /c /Fo e:\Amazon\Lumberyard\1.15.0.0\dev\BinTemp\win_x64_vs2015_profile\Gems\LmbrCentral\Code\Source\LmbrCentral.cpp.3226490.obj'
Output:
LmbrCentral.cpp
e:\Amazon\Lumberyard\1.15.0.0\dev\Gems\LmbrCentral\Code\include\LmbrCentral/Rendering/FogVolumeComponentBus.h: error C2220: warning treated as error - no 'object' file generated
e:\Amazon\Lumberyard\1.15.0.0\dev\Gems\LmbrCentral\Code\include\LmbrCentral/Rendering/FogVolumeComponentBus.h: warning C4819: The file contains a character that cannot be represented in the current code page (936). Save the file in Unicode format to prevent data loss
<++++++++++++++++++++++++++++++++++++++++++++++++++++++++++++++++++++++++++++++++++++++++++++++++++++++++++++++++++++++++++++++++++++++++++++++++++++++++++++++++++>
Process failed with return code: 1

Hi Hama. Try Open in VS2015 file "e:\Amazon\Lumberyard\1.15.0.0\dev\Gems\LmbrCentral\Code\include\LmbrCentral/Rendering/FogVolumeComponentBus.h"and when he will open VS2015 ask you about convert file to unicode just click yes and then save this file. I am not sure, but hope this help you.

Hello @Haman,

Let me try to help you out here - I see a couple of things:

  1. [WARN]Game folder ‘StarterGame’ configured in bootstrap.cfg is the enabled game for this build.In order to run or debug for the game ‘MyNewProject’, they need to be set in bootstrap.cfg under the ‘sys_game_folder’ entry accordingly - This means that there is a mismatch in the Game Project that needs to be updated. Make sure the sys_game_folder property’s value in bootstrap.cfg matches the enabled_game_projects property’s value in WAF\user_settings.options.
  2. I also notice that it seems like you are having issues with file encoding. It seems like not all the code in the engine is using Unicode which could raise issues if your windows machine is running under a different locale than English. I have raised this issue to the team to fix it in the future but in the mean time you can attempt what @Anatoliy recommended. If that doesn’t work please try to change your Windows locale setting to English and that should fix the warnings you are getting.
    Thank you!

Hi @Anatoliy I installed VS2017 for Lumberyard, and opening this file doesn’t help. Do you know if there is a way to work around it?

Hi @Haman, Looking strange. After 1.16.0.0 of Lumberyard i not saw that error. You sure all setup correctly. Try DB answer. And wich version of Lumberyard you try on this moment?